{"text_format":"1","workbook":"xlsx","n_sheets":4,"sheets":["Front","Data","Mapping","Template"],"not_rendered":{"charts":0,"images":0,"macros":1,"external_links":0,"defined_names":1033,"comments":0,"pivot_tables":0},"unopened":[],"bounds":{"document_bytes":16777216,"sheet_cells":100000,"rows_first":2000,"rows_last":500,"rows_between":2000,"halvings":0,"cell_chars":16384,"cell_head_chars":4096},"cells_cut":0,"cells_raw":0,"read":"whole","date_system":"1900"}

{"sheet":"Front","index":0,"n_rows":26,"n_cols":5,"rows_kept":26,"cut":false,"hidden":false,"merged":[[2,2,2,4],[4,3,4,4],[9,3,9,4],[14,3,14,4],[25,3,25,4]]}
[]
[]
[null,null,"Excel Report Generator"]
[]
[null,null,"Step 1 :","Import your records into the 'Data' sheet."]
[null,null,null,"a.","Fill in the Field Names/Column Headers"]
[null,null,null,"b.","Copy paste records. Prefereably as Values."]
[null,null,null,"c.","Click the 'Set Up' Button"]
[]
[null,null,"Step 2 :","Setup your Template"]
[null,null,null,"a.","Paste your Template into the 'Template' Sheet. Copy pasting all (Ctrl+V)."]
[null,null,null,"b.","Link the 'Variables' to the ranges in the 'Mapping' spreadsheet"]
[null,null,null,"c.","Print Page Setup the sheet. Also set your Default Printer to the desired one."]
[]
[null,null,"Step 3 :","Set Preferences in the 'Mapping' sheet"]
[null,null,null,"a.","Which records you want to save?"]
[null,null,null,null,"- Starting with"]
[null,null,null,null,"- Ending with"]
[null,null,null,"b.","Do you want to print each export when they are created? (Yes/No)"]
[null,null,null,"c.","Set up a file name tag that is unique for each record. Example: =\"Record  - \"&TEXT(RecordNumber,\"000\"). Feel free to use the mapping ranges to add in any unique Identification Numbers. Make sure it does not contain any special characters. Set up a similar name for the sheet name."]
[null,null,null,"d.","Choose if you'd like to protect the sheet, Workbook and/or File. And provide respective password. Remember Protecting the sheet does not allow users to make changes to the sheet; protecting the workbook does not allow the user to change the structure of the workbook. And protecting the file does not allow the user to view the content of the workbook without keying in the correct password."]
[null,null,null,"e.","Excel usually prompts the user to replace the file if a file with the sam name already exists. Setting the 'Replace Without Prompt' option to 'Yes' will suppress the prompt and replace existing files."]
[null,null,null,"f.","Click the browse button to specify where the output files should be saved. If left blank, the files would be saved along with this workbook."]
[null,null,null,"g.","Hit the 'Reset' button to bring back the default options."]
[]
[null,null,"Step 4 :","Hit the Export Button"]

{"sheet":"Data","index":1,"n_rows":12,"n_cols":504,"rows_kept":12,"cut":false,"hidden":false,"merged":[[1,1,1,503]]}
[]
[null,"Records"]
[]
[]
[]
[]
[]
[null,"Field Number",null,"InputNumber",1,2,3,4,5,6,7,8,9,10,11,12,13,14,15,16,17,18,19,20,21,22,23,24,25,26,27,28,29,30,31,32,33,34,35,36,37,38,39,40,41,42,43,44,45,46,47,48,49,50,51,52,53,54,55,56,57,58,59,60,61,62,63,64,65,66,67,68,69,70,71,72,73,74,75,76,77,78,79,80,81,82,83,84,85,86,87,88,89,90,91,92,93,94,95,96,97,98,99,100,101,102,103,104,105,106,107,108,109,110,111,112,113,114,115,116,117,118,119,120,121,122,123,124,125,126,127,128,129,130,131,132,133,134,135,136,137,138,139,140,141,142,143,144,145,146,147,148,149,150,151,152,153,154,155,156,157,158,159,160,161,162,163,164,165,166,167,168,169,170,171,172,173,174,175,176,177,178,179,180,181,182,183,184,185,186,187,188,189,190,191,192,193,194,195,196,197,198,199,200,201,202,203,204,205,206,207,208,209,210,211,212,213,214,215,216,217,218,219,220,221,222,223,224,225,226,227,228,229,230,231,232,233,234,235,236,237,238,239,240,241,242,243,244,245,246,247,248,249,250,251,252,253,254,255,256,257,258,259,260,261,262,263,264,265,266,267,268,269,270,271,272,273,274,275,276,277,278,279,280,281,282,283,284,285,286,287,288,289,290,291,292,293,294,295,296,297,298,299,300,301,302,303,304,305,306,307,308,309,310,311,312,313,314,315,316,317,318,319,320,321,322,323,324,325,326,327,328,329,330,331,332,333,334,335,336,337,338,339,340,341,342,343,344,345,346,347,348,349,350,351,352,353,354,355,356,357,358,359,360,361,362,363,364,365,366,367,368,369,370,371,372,373,374,375,376,377,378,379,380,381,382,383,384,385,386,387,388,389,390,391,392,393,394,395,396,397,398,399,400,401,402,403,404,405,406,407,408,409,410,411,412,413,414,415,416,417,418,419,420,421,422,423,424,425,426,427,428,429,430,431,432,433,434,435,436,437,438,439,440,441,442,443,444,445,446,447,448,449,450,451,452,453,454,455,456,457,458,459,460,461,462,463,464,465,466,467,468,469,470,471,472,473,474,475,476,477,478,479,480,481,482,483,484,485,486,487,488,489,490,491,492,493,494,495,496,497,498,499,500]
[null,"Field Names",null,"InputDesc"]
[]
[null,"Records","Blank_001","Blank_002","Input_001","Input_002","Input_003","Input_004","Input_005","Input_006","Input_007","Input_008","Input_009","Input_010","Input_011","Input_012","Input_013","Input_014","Input_015","Input_016","Input_017","Input_018","Input_019","Input_020","Input_021","Input_022","Input_023","Input_024","Input_025","Input_026","Input_027","Input_028","Input_029","Input_030","Input_031","Input_032","Input_033","Input_034","Input_035","Input_036","Input_037","Input_038","Input_039","Input_040","Input_041","Input_042","Input_043","Input_044","Input_045","Input_046","Input_047","Input_048","Input_049","Input_050","Input_051","Input_052","Input_053","Input_054","Input_055","Input_056","Input_057","Input_058","Input_059","Input_060","Input_061","Input_062","Input_063","Input_064","Input_065","Input_066","Input_067","Input_068","Input_069","Input_070","Input_071","Input_072","Input_073","Input_074","Input_075","Input_076","Input_077","Input_078","Input_079","Input_080","Input_081","Input_082","Input_083","Input_084","Input_085","Input_086","Input_087","Input_088","Input_089","Input_090","Input_091","Input_092","Input_093","Input_094","Input_095","Input_096","Input_097","Input_098","Input_099","Input_100","Input_101","Input_102","Input_103","Input_104","Input_105","Input_106","Input_107","Input_108","Input_109","Input_110","Input_111","Input_112","Input_113","Input_114","Input_115","Input_116","Input_117","Input_118","Input_119","Input_120","Input_121","Input_122","Input_123","Input_124","Input_125","Input_126","Input_127","Input_128","Input_129","Input_130","Input_131","Input_132","Input_133","Input_134","Input_135","Input_136","Input_137","Input_138","Input_139","Input_140","Input_141","Input_142","Input_143","Input_144","Input_145","Input_146","Input_147","Input_148","Input_149","Input_150","Input_151","Input_152","Input_153","Input_154","Input_155","Input_156","Input_157","Input_158","Input_159","Input_160","Input_161","Input_162","Input_163","Input_164","Input_165","Input_166","Input_167","Input_168","Input_169","Input_170","Input_171","Input_172","Input_173","Input_174","Input_175","Input_176","Input_177","Input_178","Input_179","Input_180","Input_181","Input_182","Input_183","Input_184","Input_185","Input_186","Input_187","Input_188","Input_189","Input_190","Input_191","Input_192","Input_193","Input_194","Input_195","Input_196","Input_197","Input_198","Input_199","Input_200","Input_201","Input_202","Input_203","Input_204","Input_205","Input_206","Input_207","Input_208","Input_209","Input_210","Input_211","Input_212","Input_213","Input_214","Input_215","Input_216","Input_217","Input_218","Input_219","Input_220","Input_221","Input_222","Input_223","Input_224","Input_225","Input_226","Input_227","Input_228","Input_229","Input_230","Input_231","Input_232","Input_233","Input_234","Input_235","Input_236","Input_237","Input_238","Input_239","Input_240","Input_241","Input_242","Input_243","Input_244","Input_245","Input_246","Input_247","Input_248","Input_249","Input_250","Input_251","Input_252","Input_253","Input_254","Input_255","Input_256","Input_257","Input_258","Input_259","Input_260","Input_261","Input_262","Input_263","Input_264","Input_265","Input_266","Input_267","Input_268","Input_269","Input_270","Input_271","Input_272","Input_273","Input_274","Input_275","Input_276","Input_277","Input_278","Input_279","Input_280","Input_281","Input_282","Input_283","Input_284","Input_285","Input_286","Input_287","Input_288","Input_289","Input_290","Input_291","Input_292","Input_293","Input_294","Input_295","Input_296","Input_297","Input_298","Input_299","Input_300","Input_301","Input_302","Input_303","Input_304","Input_305","Input_306","Input_307","Input_308","Input_309","Input_310","Input_311","Input_312","Input_313","Input_314","Input_315","Input_316","Input_317","Input_318","Input_319","Input_320","Input_321","Input_322","Input_323","Input_324","Input_325","Input_326","Input_327","Input_328","Input_329","Input_330","Input_331","Input_332","Input_333","Input_334","Input_335","Input_336","Input_337","Input_338","Input_339","Input_340","Input_341","Input_342","Input_343","Input_344","Input_345","Input_346","Input_347","Input_348","Input_349","Input_350","Input_351","Input_352","Input_353","Input_354","Input_355","Input_356","Input_357","Input_358","Input_359","Input_360","Input_361","Input_362","Input_363","Input_364","Input_365","Input_366","Input_367","Input_368","Input_369","Input_370","Input_371","Input_372","Input_373","Input_374","Input_375","Input_376","Input_377","Input_378","Input_379","Input_380","Input_381","Input_382","Input_383","Input_384","Input_385","Input_386","Input_387","Input_388","Input_389","Input_390","Input_391","Input_392","Input_393","Input_394","Input_395","Input_396","Input_397","Input_398","Input_399","Input_400","Input_401","Input_402","Input_403","Input_404","Input_405","Input_406","Input_407","Input_408","Input_409","Input_410","Input_411","Input_412","Input_413","Input_414","Input_415","Input_416","Input_417","Input_418","Input_419","Input_420","Input_421","Input_422","Input_423","Input_424","Input_425","Input_426","Input_427","Input_428","Input_429","Input_430","Input_431","Input_432","Input_433","Input_434","Input_435","Input_436","Input_437","Input_438","Input_439","Input_440","Input_441","Input_442","Input_443","Input_444","Input_445","Input_446","Input_447","Input_448","Input_449","Input_450","Input_451","Input_452","Input_453","Input_454","Input_455","Input_456","Input_457","Input_458","Input_459","Input_460","Input_461","Input_462","Input_463","Input_464","Input_465","Input_466","Input_467","Input_468","Input_469","Input_470","Input_471","Input_472","Input_473","Input_474","Input_475","Input_476","Input_477","Input_478","Input_479","Input_480","Input_481","Input_482","Input_483","Input_484","Input_485","Input_486","Input_487","Input_488","Input_489","Input_490","Input_491","Input_492","Input_493","Input_494","Input_495","Input_496","Input_497","Input_498","Input_499","Input_500"]
[null,1]

{"sheet":"Mapping","index":2,"n_rows":527,"n_cols":6,"rows_kept":527,"cut":false,"hidden":false,"merged":[[1,1,1,5],[3,1,3,2],[4,1,4,2],[5,1,5,2],[6,1,6,2],[7,1,7,2],[8,1,8,2],[9,1,9,2],[10,1,10,2],[11,1,11,2],[12,1,12,2],[13,1,13,2],[14,1,14,2],[15,1,15,2],[16,1,16,2]]}
[]
[null,"Preferences and Mapping"]
[]
[null,"Start Record",null,null,"StartRecord",1]
[null,"End Record",null,null,"EndRecord",1]
[null,"Print to Default Printer",null,null,"PrintAll","No"]
[null,"Tab Name Tag",null,null,"TabName",{"$f":"\"Record_\"&TEXT(RecordNumber,\"0000\")","v":"Record_0001"}]
[null,"File Name Tag",null,null,"FileName",{"$f":"\"Record - \"&TEXT(RecordNumber,\"0000\")","v":"Record - 0001"}]
[null,"Protect Sheet",null,null,"ProtectSheet","No"]
[null,"Protect Sheet Password",null,null,"SheetPassword"]
[null,"Protect Workbook Content",null,null,"ProtectBook","No"]
[null,"Protect Workbook Password",null,null,"BookPassword"]
[null,"Password Protect File",null,null,"ProtectFile","No"]
[null,"Protect File Password",null,null,"FilePassword"]
[null,"Replace Without Prompt",null,null,"ReplacePrompt","Yes"]
[null,"Output Folder Path",null,null,"FolderPath"]
[null,"Current Record Number",null,null,"RecordNumber",1]
[]
[]
[]
[]
[]
[]
[]
[null,"Field Number","Field Names",null,null,"Current Value"]
[]
[null,"Input","InputDescription",null,"Blank_001","CurrentValue"]
[null,1,{"$f":"IF(ISBLANK(INDEX(Data!InputDesc,Input)),\"\",INDEX(Data!InputDesc,Input))","v":""},null,"Input_001",{"$f":"IF(InputDescription=\"\",\"\",IF(OR(ISBLANK(INDEX(Data!Input_001,RecordNumber)),ISERR(INDEX(Data!Input_001,RecordNumber))),\"\",INDEX(Data!Input_001,RecordNumber)))","v":""}]
[null,2,{"$f":"IF(ISBLANK(INDEX(Data!InputDesc,Input)),\"\",INDEX(Data!InputDesc,Input))","v":""},null,"Input_002",{"$f":"IF(InputDescription=\"\",\"\",IF(OR(ISBLANK(INDEX(Data!Input_002,RecordNumber)),ISERR(INDEX(Data!Input_002,RecordNumber))),\"\",INDEX(Data!Input_002,RecordNumber)))","v":""}]
[null,3,{"$f":"IF(ISBLANK(INDEX(Data!InputDesc,Input)),\"\",INDEX(Data!InputDesc,Input))","v":""},null,"Input_003",{"$f":"IF(InputDescription=\"\",\"\",IF(OR(ISBLANK(INDEX(Data!Input_003,RecordNumber)),ISERR(INDEX(Data!Input_003,RecordNumber))),\"\",INDEX(Data!Input_003,RecordNumber)))","v":""}]
[null,4,{"$f":"IF(ISBLANK(INDEX(Data!InputDesc,Input)),\"\",INDEX(Data!InputDesc,Input))","v":""},null,"Input_004",{"$f":"IF(InputDescription=\"\",\"\",IF(OR(ISBLANK(INDEX(Data!Input_004,RecordNumber)),ISERR(INDEX(Data!Input_004,RecordNumber))),\"\",INDEX(Data!Input_004,RecordNumber)))","v":""}]
[null,5,{"$f":"IF(ISBLANK(INDEX(Data!InputDesc,Input)),\"\",INDEX(Data!InputDesc,Input))","v":""},null,"Input_005",{"$f":"IF(InputDescription=\"\",\"\",IF(OR(ISBLANK(INDEX(Data!Input_005,RecordNumber)),ISERR(INDEX(Data!Input_005,RecordNumber))),\"\",INDEX(Data!Input_005,RecordNumber)))","v":""}]
[null,6,{"$f":"IF(ISBLANK(INDEX(Data!InputDesc,Input)),\"\",INDEX(Data!InputDesc,Input))","v":""},null,"Input_006",{"$f":"IF(InputDescription=\"\",\"\",IF(OR(ISBLANK(INDEX(Data!Input_006,RecordNumber)),ISERR(INDEX(Data!Input_006,RecordNumber))),\"\",INDEX(Data!Input_006,RecordNumber)))","v":""}]
[null,7,{"$f":"IF(ISBLANK(INDEX(Data!InputDesc,Input)),\"\",INDEX(Data!InputDesc,Input))","v":""},null,"Input_007",{"$f":"IF(InputDescription=\"\",\"\",IF(OR(ISBLANK(INDEX(Data!Input_007,RecordNumber)),ISERR(INDEX(Data!Input_007,RecordNumber))),\"\",INDEX(Data!Input_007,RecordNumber)))","v":""}]
[null,8,{"$f":"IF(ISBLANK(INDEX(Data!InputDesc,Input)),\"\",INDEX(Data!InputDesc,Input))","v":""},null,"Input_008",{"$f":"IF(InputDescription=\"\",\"\",IF(OR(ISBLANK(INDEX(Data!Input_008,RecordNumber)),ISERR(INDEX(Data!Input_008,RecordNumber))),\"\",INDEX(Data!Input_008,RecordNumber)))","v":""}]
[null,9,{"$f":"IF(ISBLANK(INDEX(Data!InputDesc,Input)),\"\",INDEX(Data!InputDesc,Input))","v":""},null,"Input_009",{"$f":"IF(InputDescription=\"\",\"\",IF(OR(ISBLANK(INDEX(Data!Input_009,RecordNumber)),ISERR(INDEX(Data!Input_009,RecordNumber))),\"\",INDEX(Data!Input_009,RecordNumber)))","v":""}]
[null,10,{"$f":"IF(ISBLANK(INDEX(Data!InputDesc,Input)),\"\",INDEX(Data!InputDesc,Input))","v":""},null,"Input_010",{"$f":"IF(InputDescription=\"\",\"\",IF(OR(ISBLANK(INDEX(Data!Input_010,RecordNumber)),ISERR(INDEX(Data!Input_010,RecordNumber))),\"\",INDEX(Data!Input_010,RecordNumber)))","v":""}]
[null,11,{"$f":"IF(ISBLANK(INDEX(Data!InputDesc,Input)),\"\",INDEX(Data!InputDesc,Input))","v":""},null,"Input_011",{"$f":"IF(InputDescription=\"\",\"\",IF(OR(ISBLANK(INDEX(Data!Input_011,RecordNumber)),ISERR(INDEX(Data!Input_011,RecordNumber))),\"\",INDEX(Data!Input_011,RecordNumber)))","v":""}]
[null,12,{"$f":"IF(ISBLANK(INDEX(Data!InputDesc,Input)),\"\",INDEX(Data!InputDesc,Input))","v":""},null,"Input_012",{"$f":"IF(InputDescription=\"\",\"\",IF(OR(ISBLANK(INDEX(Data!Input_012,RecordNumber)),ISERR(INDEX(Data!Input_012,RecordNumber))),\"\",INDEX(Data!Input_012,RecordNumber)))","v":""}]
[null,13,{"$f":"IF(ISBLANK(INDEX(Data!InputDesc,Input)),\"\",INDEX(Data!InputDesc,Input))","v":""},null,"Input_013",{"$f":"IF(InputDescription=\"\",\"\",IF(OR(ISBLANK(INDEX(Data!Input_013,RecordNumber)),ISERR(INDEX(Data!Input_013,RecordNumber))),\"\",INDEX(Data!Input_013,RecordNumber)))","v":""}]
[null,14,{"$f":"IF(ISBLANK(INDEX(Data!InputDesc,Input)),\"\",INDEX(Data!InputDesc,Input))","v":""},null,"Input_014",{"$f":"IF(InputDescription=\"\",\"\",IF(OR(ISBLANK(INDEX(Data!Input_014,RecordNumber)),ISERR(INDEX(Data!Input_014,RecordNumber))),\"\",INDEX(Data!Input_014,RecordNumber)))","v":""}]
[null,15,{"$f":"IF(ISBLANK(INDEX(Data!InputDesc,Input)),\"\",INDEX(Data!InputDesc,Input))","v":""},null,"Input_015",{"$f":"IF(InputDescription=\"\",\"\",IF(OR(ISBLANK(INDEX(Data!Input_015,RecordNumber)),ISERR(INDEX(Data!Input_015,RecordNumber))),\"\",INDEX(Data!Input_015,RecordNumber)))","v":""}]
[null,16,{"$f":"IF(ISBLANK(INDEX(Data!InputDesc,Input)),\"\",INDEX(Data!InputDesc,Input))","v":""},null,"Input_016",{"$f":"IF(InputDescription=\"\",\"\",IF(OR(ISBLANK(INDEX(Data!Input_016,RecordNumber)),ISERR(INDEX(Data!Input_016,RecordNumber))),\"\",INDEX(Data!Input_016,RecordNumber)))","v":""}]
[null,17,{"$f":"IF(ISBLANK(INDEX(Data!InputDesc,Input)),\"\",INDEX(Data!InputDesc,Input))","v":""},null,"Input_017",{"$f":"IF(InputDescription=\"\",\"\",IF(OR(ISBLANK(INDEX(Data!Input_017,RecordNumber)),ISERR(INDEX(Data!Input_017,RecordNumber))),\"\",INDEX(Data!Input_017,RecordNumber)))","v":""}]
[null,18,{"$f":"IF(ISBLANK(INDEX(Data!InputDesc,Input)),\"\",INDEX(Data!InputDesc,Input))","v":""},null,"Input_018",{"$f":"IF(InputDescription=\"\",\"\",IF(OR(ISBLANK(INDEX(Data!Input_018,RecordNumber)),ISERR(INDEX(Data!Input_018,RecordNumber))),\"\",INDEX(Data!Input_018,RecordNumber)))","v":""}]
[null,19,{"$f":"IF(ISBLANK(INDEX(Data!InputDesc,Input)),\"\",INDEX(Data!InputDesc,Input))","v":""},null,"Input_019",{"$f":"IF(InputDescription=\"\",\"\",IF(OR(ISBLANK(INDEX(Data!Input_019,RecordNumber)),ISERR(INDEX(Data!Input_019,RecordNumber))),\"\",INDEX(Data!Input_019,RecordNumber)))","v":""}]
[null,20,{"$f":"IF(ISBLANK(INDEX(Data!InputDesc,Input)),\"\",INDEX(Data!InputDesc,Input))","v":""},null,"Input_020",{"$f":"IF(InputDescription=\"\",\"\",IF(OR(ISBLANK(INDEX(Data!Input_020,RecordNumber)),ISERR(INDEX(Data!Input_020,RecordNumber))),\"\",INDEX(Data!Input_020,RecordNumber)))","v":""}]
[null,21,{"$f":"IF(ISBLANK(INDEX(Data!InputDesc,Input)),\"\",INDEX(Data!InputDesc,Input))","v":""},null,"Input_021",{"$f":"IF(InputDescription=\"\",\"\",IF(OR(ISBLANK(INDEX(Data!Input_021,RecordNumber)),ISERR(INDEX(Data!Input_021,RecordNumber))),\"\",INDEX(Data!Input_021,RecordNumber)))","v":""}]
[null,22,{"$f":"IF(ISBLANK(INDEX(Data!InputDesc,Input)),\"\",INDEX(Data!InputDesc,Input))","v":""},null,"Input_022",{"$f":"IF(InputDescription=\"\",\"\",IF(OR(ISBLANK(INDEX(Data!Input_022,RecordNumber)),ISERR(INDEX(Data!Input_022,RecordNumber))),\"\",INDEX(Data!Input_022,RecordNumber)))","v":""}]
[null,23,{"$f":"IF(ISBLANK(INDEX(Data!InputDesc,Input)),\"\",INDEX(Data!InputDesc,Input))","v":""},null,"Input_023",{"$f":"IF(InputDescription=\"\",\"\",IF(OR(ISBLANK(INDEX(Data!Input_023,RecordNumber)),ISERR(INDEX(Data!Input_023,RecordNumber))),\"\",INDEX(Data!Input_023,RecordNumber)))","v":""}]
[null,24,{"$f":"IF(ISBLANK(INDEX(Data!InputDesc,Input)),\"\",INDEX(Data!InputDesc,Input))","v":""},null,"Input_024",{"$f":"IF(InputDescription=\"\",\"\",IF(OR(ISBLANK(INDEX(Data!Input_024,RecordNumber)),ISERR(INDEX(Data!Input_024,RecordNumber))),\"\",INDEX(Data!Input_024,RecordNumber)))","v":""}]
[null,25,{"$f":"IF(ISBLANK(INDEX(Data!InputDesc,Input)),\"\",INDEX(Data!InputDesc,Input))","v":""},null,"Input_025",{"$f":"IF(InputDescription=\"\",\"\",IF(OR(ISBLANK(INDEX(Data!Input_025,RecordNumber)),ISERR(INDEX(Data!Input_025,RecordNumber))),\"\",INDEX(Data!Input_025,RecordNumber)))","v":""}]
[null,26,{"$f":"IF(ISBLANK(INDEX(Data!InputDesc,Input)),\"\",INDEX(Data!InputDesc,Input))","v":""},null,"Input_026",{"$f":"IF(InputDescription=\"\",\"\",IF(OR(ISBLANK(INDEX(Data!Input_026,RecordNumber)),ISERR(INDEX(Data!Input_026,RecordNumber))),\"\",INDEX(Data!Input_026,RecordNumber)))","v":""}]
[null,27,{"$f":"IF(ISBLANK(INDEX(Data!InputDesc,Input)),\"\",INDEX(Data!InputDesc,Input))","v":""},null,"Input_027",{"$f":"IF(InputDescription=\"\",\"\",IF(OR(ISBLANK(INDEX(Data!Input_027,RecordNumber)),ISERR(INDEX(Data!Input_027,RecordNumber))),\"\",INDEX(Data!Input_027,RecordNumber)))","v":""}]
[null,28,{"$f":"IF(ISBLANK(INDEX(Data!InputDesc,Input)),\"\",INDEX(Data!InputDesc,Input))","v":""},null,"Input_028",{"$f":"IF(InputDescription=\"\",\"\",IF(OR(ISBLANK(INDEX(Data!Input_028,RecordNumber)),ISERR(INDEX(Data!Input_028,RecordNumber))),\"\",INDEX(Data!Input_028,RecordNumber)))","v":""}]
[null,29,{"$f":"IF(ISBLANK(INDEX(Data!InputDesc,Input)),\"\",INDEX(Data!InputDesc,Input))","v":""},null,"Input_029",{"$f":"IF(InputDescription=\"\",\"\",IF(OR(ISBLANK(INDEX(Data!Input_029,RecordNumber)),ISERR(INDEX(Data!Input_029,RecordNumber))),\"\",INDEX(Data!Input_029,RecordNumber)))","v":""}]
[null,30,{"$f":"IF(ISBLANK(INDEX(Data!InputDesc,Input)),\"\",INDEX(Data!InputDesc,Input))","v":""},null,"Input_030",{"$f":"IF(InputDescription=\"\",\"\",IF(OR(ISBLANK(INDEX(Data!Input_030,RecordNumber)),ISERR(INDEX(Data!Input_030,RecordNumber))),\"\",INDEX(Data!Input_030,RecordNumber)))","v":""}]
[null,31,{"$f":"IF(ISBLANK(INDEX(Data!InputDesc,Input)),\"\",INDEX(Data!InputDesc,Input))","v":""},null,"Input_031",{"$f":"IF(InputDescription=\"\",\"\",IF(OR(ISBLANK(INDEX(Data!Input_031,RecordNumber)),ISERR(INDEX(Data!Input_031,RecordNumber))),\"\",INDEX(Data!Input_031,RecordNumber)))","v":""}]
[null,32,{"$f":"IF(ISBLANK(INDEX(Data!InputDesc,Input)),\"\",INDEX(Data!InputDesc,Input))","v":""},null,"Input_032",{"$f":"IF(InputDescription=\"\",\"\",IF(OR(ISBLANK(INDEX(Data!Input_032,RecordNumber)),ISERR(INDEX(Data!Input_032,RecordNumber))),\"\",INDEX(Data!Input_032,RecordNumber)))","v":""}]
[null,33,{"$f":"IF(ISBLANK(INDEX(Data!InputDesc,Input)),\"\",INDEX(Data!InputDesc,Input))","v":""},null,"Input_033",{"$f":"IF(InputDescription=\"\",\"\",IF(OR(ISBLANK(INDEX(Data!Input_033,RecordNumber)),ISERR(INDEX(Data!Input_033,RecordNumber))),\"\",INDEX(Data!Input_033,RecordNumber)))","v":""}]
{"$rows_left_out":468}
{"sheet":"Template","index":3,"n_rows":8,"n_cols":3,"rows_kept":8,"cut":false,"hidden":false,"merged":[[1,1,2,2]]}
[]
[null,"Template"]
[]
[]
[null,"Customer Name",{"$f":"Mapping!Input_001","v":""}]
[null,"Sex",{"$f":"Mapping!Input_002","v":""}]
[null,"Date of Birth",{"$f":"Mapping!Input_003","v":""}]
[null,"Email ID",{"$f":"Mapping!Input_004","v":""}]